{"text_format":"1","workbook":"xlsx","n_sheets":12,"sheets":["Intro","Input","Train","Train (2)","Train (3)","Master_Lookup","Master_Lookup (2)","Master_Lookup (3)","Train Comparison","Master","CostMaster","Help"],"not_rendered":{"charts":0,"images":31,"macros":1,"external_links":1,"defined_names":367,"comments":0,"pivot_tables":0},"unopened":[],"bounds":{"document_bytes":16777216,"sheet_cells":100000,"rows_first":2000,"rows_last":500,"rows_between":2000,"halvings":0,"cell_chars":16384,"cell_head_chars":4096},"cells_cut":0,"cells_raw":0,"read":"whole","date_system":"1900"}

{"sheet":"Intro","index":0,"n_rows":0,"n_cols":0,"rows_kept":0,"cut":false,"hidden":false,"merged":[]}

{"sheet":"Input","index":1,"n_rows":68,"n_cols":20,"rows_kept":68,"cut":false,"hidden":false,"merged":[[3,2,3,3],[48,2,48,3]]}
[]
[null,null,null,null,null,null,null,null,null,null,null,null,null,null,null,null,null,null,null,"Flag for TX vs National"]
[null,null,"Project Name:",null,null,null,null,null,null,null,null,null,null,null,null,null,null,null,null,true]
[null,null,"[[enter name here]]"]
[]
[null,null,"Facility Size","[[enter size here]]","mgd"]
[]
[null,null,"Regulatory Approach"]
[]
[null,null,"Water Quality and Treatment Goal Inputs - Microbial Parameters:"]
{"$rows_left_out":59}
{"sheet":"Train","index":2,"n_rows":190,"n_cols":30,"rows_kept":190,"cut":false,"hidden":true,"merged":[[100,11,100,12],[121,4,121,6],[123,4,123,6],[114,4,114,6],[115,4,115,6],[116,4,116,6],[117,4,117,6],[122,4,122,6],[113,4,113,6],[102,4,102,6],[103,4,103,6],[108,4,108,6],[104,4,104,6],[118,4,118,6],[106,4,106,6],[120,4,120,6],[125,4,125,6],[107,4,107,6],[109,4,109,6],[2,5,2,6],[10,4,10,5],[91,4,91,5],[100,4,100,6],[101,4,101,6],[124,4,124,6],[105,4,105,6],[110,4,110,6],[119,4,119,6],[11,4,11,5]]}
["Train Comparison"]
[]
[0,null,null,null,"Facility Name:",{"$f":"IF(Input!C4=\"[[enter name here]]\",\"\",Input!C4)","v":""}]
[]
[]
[null,null,null,null,"Facility Size:",{"$f":"IF(Input!D6=\"[[enter size here]]\",\"\",Input!D6)","v":""},"mgd"]
[]
[null,null,null,null,"SELECT YOUR TREATMENT TRAIN:"]
[]
[null,{"$f":"IF(Input!$T$3=TRUE,SECONDARY,E12)","v":"Secondary - Nitrified Only"},null,null,"Secondary Treatment"]
{"$rows_left_out":181}
{"sheet":"Train (2)","index":3,"n_rows":190,"n_cols":30,"rows_kept":190,"cut":false,"hidden":true,"merged":[[125,4,125,6],[115,4,115,6],[116,4,116,6],[117,4,117,6],[118,4,118,6],[119,4,119,6],[120,4,120,6],[121,4,121,6],[122,4,122,6],[123,4,123,6],[124,4,124,6],[114,4,114,6],[101,4,101,6],[102,4,102,6],[103,4,103,6],[104,4,104,6],[105,4,105,6],[106,4,106,6],[108,4,108,6],[107,4,107,6],[109,4,109,6],[110,4,110,6],[113,4,113,6],[100,11,100,12],[2,5,2,6],[10,4,10,5],[11,4,11,5],[91,4,91,5],[100,4,100,6]]}
["Train Comparison"]
[]
[0,null,null,null,"Facility Name:",{"$f":"IF(Input!C4=\"[[enter name here]]\",\"\",Input!C4)","v":""}]
[]
[]
[null,null,null,null,"Facility Size:",{"$f":"IF(Input!D6=\"[[enter size here]]\",\"\",Input!D6)","v":""},"mgd"]
[]
[null,null,null,null,"SELECT YOUR TREATMENT TRAIN:"]
[]
[null,{"$f":"IF(Input!$T$3=TRUE,SECONDARY,E12)","v":"Secondary - BOD Only"},null,null,"Secondary Treatment"]
{"$rows_left_out":181}
{"sheet":"Train (3)","index":4,"n_rows":190,"n_cols":30,"rows_kept":190,"cut":false,"hidden":true,"merged":[[125,4,125,6],[115,4,115,6],[116,4,116,6],[117,4,117,6],[118,4,118,6],[119,4,119,6],[120,4,120,6],[121,4,121,6],[122,4,122,6],[123,4,123,6],[124,4,124,6],[114,4,114,6],[101,4,101,6],[102,4,102,6],[103,4,103,6],[104,4,104,6],[105,4,105,6],[106,4,106,6],[108,4,108,6],[107,4,107,6],[109,4,109,6],[110,4,110,6],[113,4,113,6],[100,11,100,12],[2,5,2,6],[10,4,10,5],[11,4,11,5],[91,4,91,5],[100,4,100,6]]}
["Train Comparison"]
[]
[0,null,null,null,"Facility Name:",{"$f":"IF(Input!C4=\"[[enter name here]]\",\"\",Input!C4)","v":""}]
[]
[]
[null,null,null,null,"Facility Size:",{"$f":"IF(Input!D6=\"[[enter size here]]\",\"\",Input!D6)","v":""},"mgd"]
[]
[null,null,null,null,"SELECT YOUR TREATMENT TRAIN:"]
[]
[null,{"$f":"IF(Input!$T$3=TRUE,SECONDARY,E12)","v":"Secondary - BOD Only"},null,null,"Secondary Treatment"]
{"$rows_left_out":181}
{"sheet":"Master_Lookup","index":5,"n_rows":74,"n_cols":39,"rows_kept":74,"cut":false,"hidden":true,"merged":[[5,30,5,31],[5,32,5,33],[3,4,3,9],[5,36,5,38],[5,34,5,35],[5,3,5,6]]}
[]
[]
[]
["PERCENT REMOVAL",null,null,null,"Values/Functions for Unit Process Effectiveness for Microbial Inactivation and Microconstituent Removals",null,null,null,null,null,null,null,null,null,null,"Start of Costs"]
[]
["Treatment","Operationally ",null,"Microbial Inactivation -\nPotential Credits(1) LOG REMOVAL",null,null,null,"Microconstituent Removals(1) PERCENT REMOVAL",null,null,null,null,null,null,null,"Unit Cost","Selected Process","Flow","Ozone Dose","Cl2\nDose","H2O2 Dose","UV Dose","Feed UVT","Subtotal Cost","Factor","Total Cost",null,null,null,null,"Ozone lookup index",null,"Cl2 lookup index",null,"H2O2 lookup index",null,"UV lookup index"]
["Process","Impotant Parameters",null,"Bacteria","Virus","Cryptosporidium","Giardia","EEQ","TOrCs","NDMA","Nitrate as N","TOC","PFOS+PFOA","Notes",null,"$/mgd",null,"mgd","mg/L","mg/L","mg/L","mJ/cm2",null,"$",null,"$",null,null,null,null,"Flow","Dose","Flow","Dose","Flow","Dose","RED","Flow","UVT"]
[]
["Secondary ",null,null,null,null,null,null,null,null,null,null,null,null,null,null,null,null,{"$f":"$R$17","v":{"$error":"#VALUE!"}}]
["Secondary - BOD Only","SRT",{"$f":"Train!F14","v":5},{"$f":"LOOKUP(C10,Master!A100:A102,Master!D100:D102)","v":2},{"$f":"Master!C16","v":2},{"$f":"Master!D16","v":0},{"$f":"Master!E16","v":0},{"$f":"LOOKUP($C$10,Master!$A$107:$A$109,Master!F107:F109)","v":0.5},{"$f":"LOOKUP($C$10,Master!$A$107:$A$109,Master!D107:D109)","v":0.5},{"$f":"Master!H16","v":0},{"$f":"Master!I16","v":0},{"$f":"Master!J16","v":0.5},{"$f":"Master!K16","v":0},null,null,{"$f":"CostMaster!C5","v":0},{"$f":"IF(A10=Train!FINAL_Secondary,1,0)","v":0},{"$error":"#VALUE!"},null,null,null,null,null,{"$f":"P10*R10","v":{"$error":"#VALUE!"}},1,{"$f":"IF(Y10*X10>0,Y10*X10, \"Not Available\")","v":{"$error":"#VALUE!"}}]
{"$rows_left_out":65}
{"sheet":"Master_Lookup (2)","index":6,"n_rows":74,"n_cols":39,"rows_kept":74,"cut":false,"hidden":true,"merged":[[5,36,5,38],[3,4,3,9],[5,3,5,6],[5,30,5,31],[5,32,5,33],[5,34,5,35]]}
[]
[]
[]
["PERCENT REMOVAL",null,null,null,"Values/Functions for Unit Process Effectiveness for Microbial Inactivation and Microconstituent Removals",null,null,null,null,null,null,null,null,null,null,"Start of Costs"]
[]
["Treatment","Operationally ",null,"Microbial Inactivation -\nPotential Credits(1) LOG REMOVAL",null,null,null,"Microconstituent Removals(1) PERCENT REMOVAL",null,null,null,null,null,null,null,"Unit Cost","Selected Process","Flow","Ozone Dose","Cl2\nDose","H2O2 Dose","UV Dose","Feed UVT","Subtotal Cost","Factor","Total Cost",null,null,null,null,"Ozone lookup index",null,"Cl2 lookup index",null,"H2O2 lookup index",null,"UV lookup index"]
["Process","Impotant Parameters",null,"Bacteria","Virus","Cryptosporidium","Giardia","EEQ","TOrCs","NDMA","Nitrate as N","TOC","PFOS+PFOA","Notes",null,"$/mgd",null,"mgd","mg/L","mg/L","mg/L","mJ/cm2",null,"$",null,"$",null,null,null,null,"Flow","Dose","Flow","Dose","Flow","Dose","RED","Flow","UVT"]
[]
["Secondary ",null,null,null,null,null,null,null,null,null,null,null,null,null,null,null,null,{"$f":"$R$17","v":{"$error":"#VALUE!"}}]
["Secondary - BOD Only","SRT",{"$f":"'Train (2)'!F14","v":7},{"$f":"LOOKUP(C10,Master!A100:A102,Master!D100:D102)","v":3},{"$f":"Master!C16","v":2},{"$f":"Master!D16","v":0},{"$f":"Master!E16","v":0},{"$f":"LOOKUP($C$10,Master!$A$107:$A$109,Master!F107:F109)","v":0.9},{"$f":"LOOKUP($C$10,Master!$A$107:$A$109,Master!D107:D109)","v":0.7},{"$f":"Master!H16","v":0},{"$f":"Master!I16","v":0},{"$f":"Master!J16","v":0.5},{"$f":"Master!K16","v":0},null,null,{"$f":"CostMaster!C5","v":0},{"$f":"IF(A10='Train (2)'!FINAL_Secondary,1,0)","v":1},{"$error":"#VALUE!"},null,null,null,null,null,{"$f":"P10*R10","v":{"$error":"#VALUE!"}},1,{"$f":"IF(Y10*X10>0,Y10*X10, \"Not Available\")","v":{"$error":"#VALUE!"}}]
{"$rows_left_out":65}
{"sheet":"Master_Lookup (3)","index":7,"n_rows":74,"n_cols":39,"rows_kept":74,"cut":false,"hidden":true,"merged":[[5,36,5,38],[3,4,3,9],[5,3,5,6],[5,30,5,31],[5,32,5,33],[5,34,5,35]]}
[]
[]
[]
["PERCENT REMOVAL",null,null,null,"Values/Functions for Unit Process Effectiveness for Microbial Inactivation and Microconstituent Removals",null,null,null,null,null,null,null,null,null,null,"Start of Costs"]
[]
["Treatment","Operationally ",null,"Microbial Inactivation -\nPotential Credits(1) LOG REMOVAL",null,null,null,"Microconstituent Removals(1) PERCENT REMOVAL",null,null,null,null,null,null,null,"Unit Cost","Selected Process","Flow","Ozone Dose","Cl2\nDose","H2O2 Dose","UV Dose","Feed UVT","Subtotal Cost","Factor","Total Cost",null,null,null,null,"Ozone lookup index",null,"Cl2 lookup index",null,"H2O2 lookup index",null,"UV lookup index"]
["Process","Impotant Parameters",null,"Bacteria","Virus","Cryptosporidium","Giardia","EEQ","TOrCs","NDMA","Nitrate as N","TOC","PFOS+PFOA","Notes",null,"$/mgd",null,"mgd","mg/L","mg/L","mg/L","mJ/cm2",null,"$",null,"$",null,null,null,null,"Flow","Dose","Flow","Dose","Flow","Dose","RED","Flow","UVT"]
[]
["Secondary ",null,null,null,null,null,null,null,null,null,null,null,null,null,null,null,null,{"$f":"$R$17","v":{"$error":"#VALUE!"}}]
["Secondary - BOD Only","SRT",{"$f":"'Train (3)'!F14","v":7},{"$f":"LOOKUP(C10,Master!A100:A102,Master!D100:D102)","v":3},{"$f":"Master!C16","v":2},{"$f":"Master!D16","v":0},{"$f":"Master!E16","v":0},{"$f":"LOOKUP($C$10,Master!$A$107:$A$109,Master!F107:F109)","v":0.9},{"$f":"LOOKUP($C$10,Master!$A$107:$A$109,Master!D107:D109)","v":0.7},{"$f":"Master!H16","v":0},{"$f":"Master!I16","v":0},{"$f":"Master!J16","v":0.5},{"$f":"Master!K16","v":0},null,null,{"$f":"CostMaster!C5","v":0},{"$f":"IF(A10='Train (3)'!FINAL_Secondary,1,0)","v":1},{"$error":"#VALUE!"},null,null,null,null,null,{"$f":"P10*R10","v":{"$error":"#VALUE!"}},1,{"$f":"IF(Y10*X10>0,Y10*X10, \"Not Available\")","v":{"$error":"#VALUE!"}}]
{"$rows_left_out":65}
{"sheet":"Train Comparison","index":8,"n_rows":36,"n_cols":16,"rows_kept":36,"cut":false,"hidden":true,"merged":[]}
[]
[]
[null,null,"Water Quality and Treatment Goal Summary",null,null,"Edit inputs"]
[]
[null,null,null,{"$f":"Input!D12","v":"Bacteria"},{"$f":"Input!E12","v":"Virus"},{"$f":"Input!F12","v":"Cryptosporidium"},{"$f":"Input!G12","v":"Giardia"}]
[null,null,{"$f":"Input!C13","v":"Treatment Goal*"},{"$f":"Input!D13","v":9},{"$f":"Input!E13","v":12},{"$f":"Input!F13","v":10},{"$f":"IF(Input!T3=TRUE,\"NA\",Input!G13)","v":"NA"}]
[{"$f":"IF(Input!T3=FALSE,TRUE,FALSE)","v":false},null,{"$f":"Input!C14","v":"Secondary Effluent Concentration"},{"$f":"Input!D14","v":"Not Applicable"},{"$f":"Input!E14","v":100},{"$f":"Input!F14","v":50},{"$f":"Input!G14","v":230}]
[null,null,{"$f":"Input!C16","v":"Target Removal*"},{"$f":"Input!D16","v":9},{"$f":"Input!E16","v":12},{"$f":"Input!F16","v":10},{"$f":"IF(Input!T3=TRUE,\"NA\",Input!G16)","v":"NA"}]
[null,null,{"$f":"Input!C17","v":"*Microbial target removal includes secondary treatment log removal credits (National case only)"}]
[]
{"$rows_left_out":27}
{"sheet":"Master","index":9,"n_rows":180,"n_cols":17,"rows_kept":180,"cut":false,"hidden":true,"merged":[[159,5,159,6],[98,1,98,2],[159,9,159,12],[112,1,112,3],[105,1,105,2],[159,2,159,3],[57,5,57,7],[49,2,49,3],[51,1,51,6],[55,1,55,3],[57,1,57,3],[55,5,55,7],[53,1,53,6],[47,1,47,6],[25,5,25,6],[17,5,17,6],[15,5,15,6],[23,5,23,6],[16,5,16,6]]}
[]
[]
[]
[]
[]
[]
[]
[]
["Master Input Table"]
[]
{"$rows_left_out":171}
{"sheet":"CostMaster","index":10,"n_rows":84,"n_cols":29,"rows_kept":84,"cut":false,"hidden":true,"merged":[[37,11,38,11],[37,12,37,19],[37,10,38,10],[1,10,2,10],[1,11,1,15],[13,10,14,10],[25,10,26,10],[25,11,25,14],[13,11,13,16]]}
[null,null,null,null,null,null,null,null,null,null,"Chlorine Lookup Table (Users Manual Table3.16)"]
["Treatment Process","Lookup Name","Cost Function",null,null,null,null,null,null,null,"Flow (mgd)","Applied Chlorine Dose (mg/L)"]
[null,null,null,null,null,null,null,null,null,null,null,1,5,10,15,25]
["Secondary ",null,null,null,null,null,null,null,null,null,1,11000,54000,107000,161000,268000]
["Conventional Activated Sludge - BOD Only",null,null,"Place holder",null,null,null,null,null,null,3,32000,161000,322000,482000,804000]
["Conventional Activated Sludge - Nutrient Removal",null,null,"Place holder",null,null,null,null,null,null,5,54000,268000,536000,804000,1340000]
["MBR",null,null,"Place holder",null,null,null,null,null,null,10,107000,536000,1072000,1608000,2680000]
["Membrane Processes",null,null,null,"Multiplier","Equipment Cost",null,null,null,null,25,268000,1340000,2680000,4020000,6700000]
["MF","MF",{"$f":"E9*F9","v":2500000},{"$f":"\"/mgd\"","v":"/mgd"},5,500000,"/ mgd"]
["UF","UF",{"$f":"E10*F10","v":2500000},{"$f":"\"/mgd\"","v":"/mgd"},{"$f":"E9","v":5},500000,"/ mgd"]
{"$rows_left_out":75}
{"sheet":"Help","index":11,"n_rows":127,"n_cols":8,"rows_kept":127,"cut":false,"hidden":false,"merged":[]}
[]
[]
[]
[]
[]
[null,null,"Last Updated:","2017-05-31",null,"Version 2.1"]
[]
[null,"QUICK START GUIDE"]
[]
[]
{"$rows_left_out":117}